如何解决安装PHP7.3.7时make: *** [sapicliphp]Error1的问题?
- 内容介绍
- 文章标签
- 相关推荐
本文共计530个文字,预计阅读时间需要3分钟。
问题原因:安装PHP 7.3.7过程中,configure步骤正常,但在make时出现错误:make: *** [sapi/cli/php] Error 1。
解决方法记录:
1.确认系统环境满足PHP安装要求,如GCC、Make、autoconf等。
2.检查PHP源码包是否完整。
3.尝试清理编译过程中产生的临时文件和缓存,使用命令:`make clean`。
4.重新执行configure命令,可能需要指定额外配置参数,例如:
5.如果上述步骤无效,尝试使用更旧的编译器版本,例如GCC 4.9。
6.检查makefile文件中的依赖关系,确认是否有错误的引用或路径。
7.如果问题依旧,尝试查找类似问题的网络论坛或官方文档,以获取更多信息。
本文共计530个文字,预计阅读时间需要3分钟。
问题原因:安装PHP 7.3.7过程中,configure步骤正常,但在make时出现错误:make: *** [sapi/cli/php] Error 1。
解决方法记录:
1.确认系统环境满足PHP安装要求,如GCC、Make、autoconf等。
2.检查PHP源码包是否完整。
3.尝试清理编译过程中产生的临时文件和缓存,使用命令:`make clean`。
4.重新执行configure命令,可能需要指定额外配置参数,例如:
5.如果上述步骤无效,尝试使用更旧的编译器版本,例如GCC 4.9。
6.检查makefile文件中的依赖关系,确认是否有错误的引用或路径。
7.如果问题依旧,尝试查找类似问题的网络论坛或官方文档,以获取更多信息。

![如何解决安装PHP7.3.7时make: *** [sapicliphp]Error1的问题?](/imgrand/JfYwNuAY.webp)